[ardour-users] Compile problems with Ardour-0.9beta18.4

David Engqvist david.engqvist at telia.com
Sun Jul 25 16:15:03 PDT 2004

Hi folks,

Trying to install Ardour but recieves this error message when doing make:

 -lsamplerate    -lasound -ldl -lpthread
../libs/ardour/.libs/libardour.a(audioengine.o)(.text+0xd4a): In function 
: undefined reference to `jack_set_thread_init_callback'
collect2: ld returned 1 exit status
make[3]: *** [ardour] Error 1
make[3]: Leaving directory `/home/arklinux/ardour-0.9beta18.4/gtk_ardour'
make[2]: *** [all-recursive] Error 1
make[2]: Leaving directory `/home/arklinux/ardour-0.9beta18.4/gtk_ardour'
make[1]: *** [all] Error 2
make[1]: Leaving directory `/home/arklinux/ardour-0.9beta18.4/gtk_ardour'
make: *** [all-recursive] Error 1

I've compiled jack 0.98.1 without any errors so I don't really understand 


More information about the Ardour-Users mailing list