[ardour-dev] make error

R Parker rtp405 at yahoo.com
Mon Dec 13 17:48:25 PST 2004

more undefined references to
std::char_traits<char>, std::allocator<char> > const&,
bool, bool)' follow
collect2: ld returned 1 exit status
make[3]: *** [ardour] Error 1
make[3]: Leaving directory
make[2]: *** [all-recursive] Error 1
make[2]: Leaving directory
make[1]: *** [all] Error 2
make[1]: Leaving directory
make: *** [all-recursive] Error 1

Do you Yahoo!? 
Jazz up your holiday email with celebrity designs. Learn more. 

More information about the Ardour-Dev mailing list