[ardour-users] ardour2.0-alpha2 compile error

timg timg at expressmart.com
Thu Mar 16 12:29:54 PST 2006

getting this error ..
I made ardour.9XX
without issue..

   function `static Gnome::Art::AffineTrans
libs/libgnomecanvasmm/libgnomecanvasmm/affinetrans.cc:205: error: `
   art_affine_shear' undeclared (first use this function)
libs/libgnomecanvasmm/libgnomecanvasmm/affinetrans.cc: In member function `
   Glib::ustring Gnome::Art::AffineTrans::to_string() const':
libs/libgnomecanvasmm/libgnomecanvasmm/affinetrans.cc:223: error: `
   art_affine_to_string' undeclared (first use this function)
scons: *** [libs/libgnomecanvasmm/libgnomecanvasmm/affinetrans.o] Error 1
scons: building terminated because of errors.

The information contained in this email is confidential, intended 
only for the use of the party to whom it is addressed. If you are 
not the intended recipient, please be aware that you are strictly 
prohibited from sharing,distributing, or copying this email. 
If you have received this email by mistake, please notify the sender.  

Thank you
Timothy Alan Gorman
Petr-all Petroleum / ExpressMart
6567 Kinne rd Dewitt ny 13214
Cell 315 415 8108
Office 315 446 0125 x 126

More information about the Ardour-Users mailing list