[ardour-users] 9.13.1 suse 9.1 errorlist after "make"

rabbit sorax at powerup.com.au
Tue Jun 29 00:20:53 PDT 2004

Hi Friends

Yes I got past ./configure !! Now you probably believe it I have got another 
problem....please read the last few lines of "make":

Making all in gtkmmproc
make[5]: Entering directory 
yacc  -d `test -f 'parser.yy' || echo './'`parser.yy
/bin/sh: line 1: yacc: command not found
make[5]: *** [parser.cc] Error 127
make[5]: Leaving directory 
make[4]: *** [all-recursive] Error 1
make[4]: Leaving directory `/usr/share/ardour-0.9beta16.1/libs/gtkmm/src'
make[3]: *** [all-recursive] Error 1
make[3]: Leaving directory `/usr/share/ardour-0.9beta16.1/libs/gtkmm'
make[2]: *** [all] Error 2
make[2]: Leaving directory `/usr/share/ardour-0.9beta16.1/libs/gtkmm'
make[1]: *** [all-recursive] Error 1
make[1]: Leaving directory `/usr/share/ardour-0.9beta16.1/libs'
make: *** [all-recursive] Error 1
linux:/usr/share/ardour-0.9beta16.1 #

...so ? what does that mean ??? ..what is that yacc comand ?

Thanks Otto

More information about the Ardour-Users mailing list